numcentre,nomcentre,subjid,numpatient,initialenom,initialeprenom,nonoppositioncanada,patientmajeur,patienthospitrea,infoetude,femmeenceinte,patientsoustutelle,patientnonaffiliesecu,patientincluable,patientincluable2,datenaissance,DATEDENAISSANCED1,agecalcule,agecalcule2,sexe,taille,poidsideal,poidsideal2,poids,imc,imc2,diagnosticprincipal,siautrepreciser_dem,categoriedadmission,igsii,datedadmission,DATEDADMISSIOND1,datedespectrum,DATEDESPECTRUMD1,datedesortiedereanimation,DATEDESORTIEDEREANIMATIOND1,statutvital,bpco,asthme,syndromeobesitehypoventil,autreinsuffisancerespiratoire,maladiepulmointerstitielle,autreinsuffrespiratoire,syndromeapneesommeil,oxygenotherapielt,ventilnoninvasive,ventilnocturne,insuffcardiaque,insuffrenale,cirrhose,cancerhemato,patientimmunodeprime,gazsang,PO2SPECTRUM,SAO2_releveoxygen,SPO2LITMALADE,ph_releveoxygen,PCO2_releveoxygen,HCO3_releveoxygen,lactates_releveoxygen,positioncapteur,siautrepreciser_releveoxygen,contentionphysique,lutterespiratoire,pas,pad,pam,marbrurescutanees,traitcatecholamines,ALARMESPO2BS1,ALARMESPO2BS2,ALARMESPO2HAUTE,intuboronasotracheale,tracheotomie,sedationiv,curarisation,oxygenoextracorporelle,type,debitbalayage,epurationextracorporelle,scoreglasgowe,scoreglasgowv,scoreglasgowm,scorerass,encombrementbronchique,frmesuree,protectioncutanee,escarrelieaventil,modalitedassistresp,FIO2_VI_VNI_HD,debitdoxygene_releveoxygen,FIO2CALCULEEOXYGNETIONSTANDARD,oxygenotherapieextracorporelle,FIO2_releveoxygen,oxygenationparcec,assistventilintermittent,releveoxygenation,secondgazdusang_releveoxygen,PO2_releveoxygen,SAO21,SPO2AULITDUMALADE,modedeventilation,FIO21,VALEURDEPAO2,VALEURDESPO2,FIO2MAXANTESPECTRUM,DEBITDEO2LEPLUSELEVE,P02ANTESPECTRUM,VALEURDESPO21,FIO2LAPLUSELEVEE,DEBITDEO2LEPLUSELEVE1,modeassistanceresp_oxyst,modeadministration,debitdoxygene,systhumidification,FIO2CALCULEEOXYSTANDARD,modeassistanceresp_oxyhautdeb,debitdegaz,FIO2_oxyhautdeb,modeassistresp_VNI,ventilassistcontrolee,VCR_VAC_VNI,FREQRESPR_VAC,PER_VAC_VNI,FIO2_VAC_VNI,CVE_AI,nai_VNI,PER_AI_VNI,FIO2_AI_VNI,cpap_VNI,FIO2_CPAP_VNI,VCE_BIPAP_VNI,PIR_BIPAP_VNI,PER_BIPAP_VNI,FREQRESPR_BIPAP,FIO2_BIPAP_VNI,VCE_AUTRE_VNI,PERIPAP_AUTRE,PER_AUTRE_VNI,FREQRESPR_AUTRE,FIO2_AUTRE_VNI,autreinfo,interfacevni,modaliterechauffement,modeassistresp_VI,var,VCR_VAC_VI,FRR_VAC_VI,PER_VAC_VI,FIO2_VAC_VI,VCR_VACI,FRR_VACI,PER_VACI,NAI_VACI,FIO2_VACI,VCE_VSAI,NAI_VSAI,PER_VSAI,FIO2_VSAI,amp,VCE_AMP,PIR_AMP,PER_AMP,FRR_AMP,FIO2_AMP,modeventilatoire,VCR_AUTRE,VCE_AUTRE_VI,PIR_AUTRE_VI,PER_AUTRE_VI,FRR_AUTRE,FIO2_AUTRE_VI,autrepreciser_VI,ETCO2DISPO,ETCO2,moderechaffegaz,decubitusventral_VI,dureesceance,escarrefaceantecorps,accidentretourne,noinhale_VI,mvtsrespspontanes,pressionplateau,pressionexpirtotale,recrutalveolaire,evalcourbepressionvolu,stressindex,strategiepepelevee,limitaeapressionplateau,limitationdelapressionmotrice,datascannographiques,dataechographiques,TABLEPEPFIO2,tolerancehemodynamique,mesurecapaciteresiduelle,mesurepressionoesophage,assistventilintermittente,secondgazdusang,ph_VINTER,PCO2_VINTER,PO2,SAO2_VINTER,HCO3_VINTER,lactates_VINTER,SPO2LITDUMALADE,fr,nbsceancesventil,dureemoysceances,typeventilintermittante,autretypepreciser,modeventil,autremodepreciser,VCR_VAC_VINTER,FRR_VAC_VINTER,PER_VAC_VINTER,FIO2_VAC_VINTER,VCE_AI,nai_VINTER,PER_AI_VINTER,FIO2_AI_VINTER,cpap_VINTER,FIO2_CPAP_VINTER,VCE_BIPAP_VINTER,PIR_BIPAP_VINTER,PER_BIPAP_VINTER,FRR_BIPAP,FIO2_BIPAP_VINTER,VCE_AUTRE_VINTER,PIR_AUTRE_VINTER,PER_AUTRE_VINTER,FIO2_AUTRE_VINTER,autrepreciser_VINTER,interfacedevni,protectionvni,escarreliealavni,modalitesderechauffementdelavni,aggressionclinique,aggravsymptomescliniques,opacitesradio,opacitesunilaterales,opacitesbilaterales,opacitesnontotalementexpliquees,epanchementpleural,atelectasie,nodulesassocies,hypoxemie,defaillancecardiaque,defaillancehydrosodee,pneumonie,sepsisextrapulmo,inhalationliqgastrique,polytraumatisme,contusionpulmonaire,pancreatiteaigue,inhalationfumeetoxique,bruluresgraves,chocnoncardiogenique,surdosemedicament,transfusionmultiple,vascularitepulmo,noyade,autre,autrepreciser_sdra,oedemepulmo,surchargehydrosodee,emboliepulmonaire,exacerbationdinsuffresp,EPANCHEMENTPLEURAL1,ATELECTASIE1,pneumothorax,etatdechoc,foramenovalepermeable,intoxicationco,autrecause,siautrepreciser_sdra,radiothoracique,scannerthoracique,gazdusangarteriel,etteto,lavagebronchoalveolaire,cathetercardiaque,debitcardiaquecontinu,catheterarteriel,catheterveineux,transportintrahospitalier,alimentationenterale,miseaufauteuil,limitationstherapeutiques,arrettherapeutiquesautres,visite_avspectr,datedadmission_avspectr,DATEDADMISSIOND1_avspectr,datedespectrum_avspectr,DATEDESPECTRUMD1_avspectr,datedesortiedereanima_avspectr,DATEDESORTIEDEREANIMAD1_avspectr,nbtoilettes,evachargeparamedicaux,FIO2MAX_avspectr,DEBITO2MAX_avspectr,PO2_avspectr,SPO2_avspectr,imagesradio_avspectr,debutaigupatho_avspectr,peep,oxygenotherapiesimple_avspectr,oxygenotherapiehautdebit,vni_avspectr,vi_avspectr,oxygenationextracorpoveine,oxygenationextracorpoart,EPURATIONEXTRACORPOCO2,decubitusventral_avspectr,noinhale_avspectr,perfmedvasopresseurs,perfmedinotropes,epurationextrarenale_avspectr,visite_apspectr,datedadmission_apspectr,DATEDADMISSIOND1_apspectr,datedespectrum_apspectr,DATEDESPECTRUMD1_apspectr,datedesortiedereanimation_apspec,DATEDESORTIEDEREANIMAD1_apspectr,FIO2MAX_apspectr,DEBITO2MAX_apspectr,PO2_apspectr,SPO2_apspectr,imagesradio_apspectr,debutaigupatho_apspectr,pep,oxygenotherapiesimple_apspectr,oxygenotherapieahautdebit,vni_apspectr,vi_apspectr,oxygenotherapieextracorpoveine,oxygenotherapieextracorpoart,EPURATIONEXTRACORPORELLEDECO2,decubitusventral_apspectr,noinhale_apspectr,perfvasopresseurs,perfinotropes,epurationextrarenale_apspectr,decessortierea,FIO2_VNI,FIO2_VI,FIO2_oxyHD,FIO2_airambiant,FIO2_oxygenstandard,FIO2_final1,FIO2_final2,SpO2surFiO2,PsurF_RICE,PsurF_final1,FIO21_2,SpO2surFiO2_2,PsurF_RICE2,PsurF_final2,PsurF_final3,hypoxemie_2cl,hypoxemie_3cl,SDRA_analyse1_strate4,SDRA_analyse1_strate4_ventON,PERchezpatientventilé,SDRA_analyse1_strate4_ventO_PER5,SDRA_A1A2,SDRA_analyse1_strate4_ventN,SDRA_analyse2_strate1,gazsang_avspectrum,FIO2_oxygenstandard_avspectr,FIO2_final1_avspectr,SpO2surFiO2_avspectr,PsurF_RICE_avspectrum,PsurF_final_avspectr,SDRA_analyse2_strate2,SDRA_analyse2_strate3,SDRA_analyse2_strate3_ventON,SDRA_E1E2,SDRA_berlin,SDRA_berlin_VI_VNI,SDRA_elargi,SDRA_elargi_vent_nonvent,SDRA_berlin_3cl,SDRA_elargi_3cl,SDRAavspect_analyse1_strate1,SDRAavspect_analyse1_strate2_1,SDRA_H1H2,SDRAavspect_analyse1_strate2_2,gazsang_apspectrum,FIO2_oxygenstandard_apspectr,FIO2_final1_apspectr,SpO2surFiO2_apspectr,PsurF_RICE_apspectrum,PsurF_final_apspectr,SDRAapspect_analyse2_strate1,SDRAapspect_analyse2_strate2_1,SDRA_J1J2,SDRAapspect_analyse2_strate2_2,SDRA_berlin_pronos,SDRA_berlin_pronos_VI_VNI,SDRA_elargi_pronos,SDRA_elargi_pronos_vent_nonvent,obese,scoreglasgow,var2,modalitedassistresp_2cl,evachargeparamedicaux2,VCRE_VI,VCRE_VI_pdsideal,VCRE_VI_pdsideal_4cl,PER_VI,diffpressplat_pressexptot,VCRE_VNI,VCRE_VNI_pdsideal,VCRE_VNI_pdsideal_4cl,PER_VNI,catecholamine_av_ap_JSPECTR,epurextrarenale_av_ap_JSPECTR,decuventral_av_ap_JSPECTR,oxyextracorpoveine_av_ap_JSPECTR,oxyextracorpoart_av_ap_JSPECTR,NOinhale_av_ap_JSPECTR,PsurF_pronos_final,hypoxemie_2cl_pronos,hypoxemie_3cl_pronos,modaliteventi_pronos_mod1,modaliteventi_pronos_mod2,modaliteventi_pronos_mod3,datedespectrum2,DATEDESPECTRUMD1_2,datedesortiedereanimation2,DATEDESORTIEDEREANIMATIOND1_2,merge1,decessortierea2,merge2,DATEDADMISSIOND1_2,duree_sejour,annee_naiss,hypoxienovounilateral2,datedespectrum3,DATEDESPECTRUMD1_3,merge3,delai_dateadmis_datedebspec,decessortierea3,modalitedassistresp_VentInter,SDRA_berlin_2cl,SDRA_elargi_2cl,oxygenoextracorporelle_selontype,calcul_PsurF,VCRE_VI_pdsideal_3cl,VCRE_VI_pdsideal_2cl,VCRE_VNI_pdsideal_3cl,VCRE_VNI_pdsideal_2cl,PCO2_releveoxygen_2cl,Aumoins1FDRdeSDRA,SDRA_berlin2,SDRA_berlin_3cl2,SDRA_elargi2,SDRA_elargi_3cl2,pathoobstructivechro,pathorestrictivechro,syndromehypoapnee,O2ouVNIlongcours,diagnosticprincipal2,admission_Jspectrum,delai_datedebspect_datesortie,sortie_Jspectrum,hypoxemie_4cl,PO2SPECTRUM_2cl,ICUfreeday_J28,datedepoint_J90,duree_sejour_J90,decessortierea4,PsurF_final3_inverse,PsurF_final3_inverse_par10,SDRA_elargi_vent_nonvent2,hypoxienovounilateral3,SDRA_berlin_2cl2,SDRA_elargi_2cl2,hypoxemie_2cl_apspectr,hypoxemie_3cl_apspectr,diagnosticprincipal3,nbrecausehypoxemie,nbrecausehypoxemie_4cl,nbrecausehypoxemie_3cl
002,Paris - Réanimation Médicale,002-01,002-01,C,P,0,1,1,1,0,0,0,,1,NA/12/1950,,65,65,1,165,61.25,"61,25",70,25.71,"25,71",7,,1,32,08/03/2016,08/03/2016,30/03/2016,30/03/2016,05/04/2016,05/04/2016,0,0,0,0,0,0,0,0,0,0,0,1,1,1,0,1,0,,,100,,,,,1,,0,0,99,73,86,0,0,90,,100,1,0,0,0,0,,,0,4,1,5,-1,1,12,0,1,5,21,,,0,,0,,,,,,,,,54,,30,,72,,30,,5,,,,21,5,,,5,,,,,,,,,,,,,,,,,,,,,,,,,5,1,520,12,5,21,,,,,,,,,,,,,,,,,,,,,,,,0,,3,0,,,,0,1,,,1,0,0,0,0,0,0,0,0,0,0,0,0,,,,,,,,,,,,,,,,,,,,,,,,,,,,,,,,,,,,,,,,0,0,1,0,1,1,1,0,0,0,1,1,0,0,0,0,0,0,0,0,0,0,0,0,0,0,,1,1,0,0,0,0,0,0,0,0,0,,3,1,1,1,1,1,1,1,2,1,2,2,2,1,Avant Spectrum,08/03/2016,08/03/2016,30/03/2016,30/03/2016,05/04/2016,05/04/2016,4,0,30,,54,,0,1,0,1,0,1,1,0,0,0,0,0,1,0,1,Après Spectrum,08/03/2016,08/03/2016,30/03/2016,30/03/2016,05/04/2016,05/04/2016,30,,72,,1,0,1,1,0,0,1,0,0,0,0,0,0,0,1,0,,21,,,,21,"0,209999993443489","476,190490722656","490,702972412109","490,702972412109",,,,"490,702972412109","490,702972412109",0,,,,5,,,,,,,"0,300000011920929",,,180,,,,,0,,0,,,,1,,,,,,"0,300000011920929",,,"239,999984741211",1,,,,0,,0,,0,10,1,2,0,520,"8,48979568481445",4,5,,,,,,1,1,0,0,0,0,180,1,2,2,2,3,30/03/2016,30/03/2016,05/04/2016,05/04/2016,3,0,3,08/03/2016,28,1950,,30/03/2016,30/03/2016,3,22,1,5,,,0,3,3,2,,,,0,0,,0,,0,0,0,0,7,0,6,0,0,,0,05/04/2016,28,1,"-490,702972412109","-49,0702972412109",,,,,1,1,7,2,3,2
002,Paris - Réanimation Médicale,002-02,002-02,D,P,0,1,1,1,0,0,0,,1,NA/01/1941,,75,75,1,172,66.5,"66,5",77,26.03,"26,03",10,,1,46,26/03/2016,26/03/2016,30/03/2016,30/03/2016,05/04/2016,05/04/2016,1,0,0,0,0,0,0,0,0,0,0,1,0,0,0,0,1,83,97,98,"7,38",48,29,"1,1",1,,0,0,95,42,58,0,1,90,,100,1,0,1,0,0,,,0,1,1,1,-5,1,16,0,0,5,30,,,0,,0,,,,,,,,,80,,50,,95,,50,,5,,,,21,5,,,5,,,,,,,,,,,,,,,,,,,,,,,,,5,1,520,12,5,30,,,,,,,,,,,,,,,,,,,,,,,,0,,3,0,,,,0,0,18,5,1,0,0,0,0,0,0,0,0,1,0,0,0,,,,,,,,,,,,,,,,,,,,,,,,,,,,,,,,,,,,,,,,0,0,1,0,1,1,1,1,0,0,1,0,0,0,0,0,0,0,0,0,0,0,0,0,0,0,,1,1,0,0,0,1,0,0,0,0,0,,3,3,3,3,1,1,1,2,2,3,2,1,1,1,Avant Spectrum,26/03/2016,26/03/2016,30/03/2016,30/03/2016,05/04/2016,05/04/2016,4,3,50,,80,,1,1,0,1,0,1,1,0,0,0,0,0,1,0,0,Après Spectrum,26/03/2016,26/03/2016,30/03/2016,30/03/2016,05/04/2016,05/04/2016,50,,95,,1,0,1,1,0,1,1,0,0,0,0,0,0,0,0,1,,30,,,,30,"0,300000011920929",,,"276,666656494141",,,,"276,666656494141","276,666656494141",1,1,,,5,,,,1,,,"0,5",,,160,1,,,,0,,0,,,,1,,,1,,,"0,5",,,190,1,,,,0,,1,2,0,3,1,2,3,520,"7,81954908370972",3,5,13,,,,,1,0,0,0,0,0,160,1,2,2,2,3,30/03/2016,30/03/2016,05/04/2016,05/04/2016,3,1,3,26/03/2016,10,1941,,30/03/2016,30/03/2016,3,4,0,5,,,0,1,2,1,,,1,0,0,,0,,0,0,0,0,10,0,6,0,1,1,1,05/04/2016,10,0,"-276,666656494141","-27,6666660308838",,,,,1,2,10,3,4,3
002,Paris - Réanimation Médicale,002-03,002-03,W,O,0,1,1,1,0,0,0,,1,NA/06/1991,,24,24,2,157,54.2,"54,2",41,16.63,"16,63",7,,1,68,22/03/2016,22/03/2016,30/03/2016,30/03/2016,09/04/2016,09/04/2016,1,0,0,0,1,0,0,0,0,0,0,0,1,0,0,1,1,71,97,100,"7,49",26,20,"0,4",1,,0,0,90,61,72,0,0,90,,100,1,0,0,0,0,,,0,1,1,1,-5,1,18,0,0,5,21,,,0,,0,,,,,,,,,144,,100,,62,,,2,5,,,,21,5,,,5,,,,,,,,,,,,,,,,,,,,,,,,,5,3,,,,,,,,,,445,16,5,21,,,,,,,,,,,,,,,0,,3,0,,,,0,1,,,0,0,0,0,0,0,0,0,0,0,0,0,0,,,,,,,,,,,,,,,,,,,,,,,,,,,,,,,,,,,,,,,,1,1,1,0,1,1,1,0,0,1,0,0,1,0,1,0,0,0,0,0,1,0,0,0,0,0,,0,0,0,0,0,0,0,0,0,0,0,,3,3,3,1,1,1,1,2,2,1,2,1,1,1,Avant Spectrum,22/03/2016,22/03/2016,30/03/2016,30/03/2016,09/04/2016,09/04/2016,6,3,100,,144,,1,1,1,1,1,1,1,0,0,0,0,0,1,0,1,Après Spectrum,22/03/2016,22/03/2016,30/03/2016,30/03/2016,09/04/2016,09/04/2016,,2,62,,0,0,0,1,0,0,0,0,0,0,0,0,0,0,1,1,,21,,,,21,"0,209999993443489",,,"338,095245361328",,,,"338,095245361328","338,095245361328",0,,,,5,,,,,,,1,,,144,,,,,0,,0,,,,1,1,1,,,27,"0,270000010728836",,,"229,629623413086",1,,,,1,1,1,1,0,3,0,2,3,445,"8,21033191680908",4,5,,,,,,1,1,0,0,0,0,144,1,2,2,2,3,30/03/2016,30/03/2016,09/04/2016,09/04/2016,3,1,3,22/03/2016,18,1991,,30/03/2016,30/03/2016,3,8,0,5,,,0,1,3,2,,,0,1,0,,0,,1,0,0,0,7,0,10,0,0,0,1,09/04/2016,18,0,"-338,095245361328","-33,8095245361328",,,,,1,1,7,2,3,2
002,Paris - Réanimation Médicale,002-04,002-04,G,J,0,1,1,1,0,0,0,,1,NA/03/1935,,81,81,1,175,68.75,"68,75",79,25.8,"25,8",7,,1,58,27/03/2016,27/03/2016,30/03/2016,30/03/2016,06/04/2016,06/04/2016,1,1,0,0,0,0,0,0,0,0,0,0,0,0,1,1,1,69,95,95,"7,42",33,23,"1,1",1,,0,0,144,75,95,0,0,88,,100,0,1,0,0,0,,,0,4,5,6,,2,16,1,0,2,,1,24,0,,0,0,,,,,,,,84,,,1,,,,,2,3,1,0,24,2,,,2,,,,,,,,,,,,,,,,,,,,,,,,,2,,,,,,,,,,,,,,,,,,,,,,,,,,,,,,,,,,,,,,,,,,,,,,,,,,,,0,,,,,,,,,,,,,,,,,,,,,,,,,,,,,,,,,,,,,,,,0,0,0,,,,,,,0,0,0,0,0,0,0,0,0,0,0,0,0,0,0,0,0,,0,0,0,0,0,0,0,0,0,0,0,,1,1,3,1,1,1,1,1,1,1,2,2,1,1,Avant Spectrum,27/03/2016,27/03/2016,30/03/2016,30/03/2016,06/04/2016,06/04/2016,4,2,,1,84,,0,0,1,1,0,0,1,0,0,0,0,0,0,0,0,Après Spectrum,27/03/2016,27/03/2016,30/03/2016,30/03/2016,06/04/2016,06/04/2016,,,,,,,,1,0,0,0,0,0,0,0,0,0,0,0,1,,,,,24,24,"0,239999994635582",,,"287,5",,,,"287,5","287,5",1,1,,,,,,,,,24,"0,239999994635582",,,350,,,,,0,,0,,,,,,,,,,,,,,,,,,0,,0,,0,15,,1,2,,,,,,,,,,0,0,0,0,0,0,"287,5",1,1,2,8,5,30/03/2016,30/03/2016,06/04/2016,06/04/2016,3,1,3,27/03/2016,10,1935,,30/03/2016,30/03/2016,3,3,0,2,,,0,2,,,,,0,0,0,,0,,1,0,0,0,7,0,7,0,1,0,1,06/04/2016,10,0,"-287,5","-28,75",,,,,,,7,0,1,1
002,Paris - Réanimation Médicale,002-05,002-05,D,P,0,1,1,1,0,0,0,,1,NA/04/1973,,0,0,1,183,74.75,"74,75",79,23.59,"23,59",16,DELIRIUM TREMENS,1,34,20/03/1973,20/03/1973,30/03/2016,30/03/2016,05/04/2016,05/04/2016,1,0,0,0,0,0,0,0,0,0,0,0,0,0,0,0,0,,,100,,,,,1,,0,0,121,88,90,0,0,90,,,0,0,0,0,0,,,0,4,4,6,,2,17,0,0,2,,1,24,0,,0,0,,,,,,,,87,,25,,50,,,6,2,1,1,0,24,2,,,2,,,,,,,,,,,,,,,,,,,,,,,,,2,,,,,,,,,,,,,,,,,,,,,,,,,,,,,,,,,,,,,,,,,,,,,,,,,,,,0,,,,,,,,,,,,,,,,,,,,,,,,,,,,,,,,,,,,,,,,0,0,0,,,,,,,0,0,0,0,0,0,0,0,0,0,0,0,0,0,0,0,0,,0,0,0,0,0,0,0,0,0,0,0,,1,1,2,1,1,1,1,1,1,1,2,2,1,1,Avant Spectrum,20/03/1973,20/03/1973,30/03/2016,30/03/2016,05/04/2016,05/04/2016,4,6,25,,87,,0,0,0,1,0,0,1,0,0,0,0,0,0,0,0,Après Spectrum,20/03/1973,20/03/1973,30/03/2016,30/03/2016,05/04/2016,05/04/2016,,6,50,,1,1,0,1,0,0,1,0,0,0,0,0,0,0,0,1,,,,,24,24,"0,239999994635582","416,666687011719","419,84130859375","419,84130859375",,,,"419,84130859375","419,84130859375",0,,,,,,,,,,,"0,25",,,348,,,,,0,,0,,,,,,,,,39,"0,389999985694885",,,"128,205139160156",1,,,1,0,,1,2,0,14,,1,6,,,,,,,,,,0,0,0,0,0,0,"128,205139160156",1,2,2,8,5,30/03/2016,30/03/2016,05/04/2016,05/04/2016,3,1,3,20/03/2016,16,1973,,30/03/2016,30/03/2016,3,10,0,2,,,0,4,,,,,,0,0,,0,,0,0,0,0,16,0,6,0,0,,1,05/04/2016,16,0,"-419,84130859375","-41,984130859375",,,,,1,2,16,0,1,1
002,Paris - Réanimation Médicale,002-06,002-06,M,G,0,1,1,1,0,0,0,,1,NA/10/1976,,39,39,1,168,63.5,"63,5",72,25.51,"25,51",7,,2,27,25/03/2016,25/03/2016,30/03/2016,30/03/2016,07/04/2016,07/04/2016,1,0,0,0,0,0,0,0,0,0,0,0,0,0,0,0,1,93,97,100,"7,39",47,28,"0,6",1,,0,0,130,60,75,0,0,90,,100,1,0,1,1,0,,,0,1,1,1,-1,,32,0,0,5,50,,,0,,0,,,,,,,,,92,,100,,80,,50,,5,,,,21,5,,,5,,,,,,,,,,,,,,,,,,,,,,,,,5,1,520,15,5,50,,,,,,,,,,,,,,,,,,,,,,,,0,,3,0,,,,0,1,,,1,0,0,0,0,0,0,0,0,0,0,0,0,,,,,,,,,,,,,,,,,,,,,,,,,,,,,,,,,,,,,,,,1,1,1,0,1,1,0,0,0,1,0,0,1,0,0,0,0,0,0,0,0,0,0,0,0,0,,0,0,0,0,0,0,0,0,0,0,0,,3,1,3,2,1,1,1,1,1,1,1,1,1,1,Avant Spectrum,25/03/2016,25/03/2016,30/03/2016,30/03/2016,07/04/2016,07/04/2016,4,6,100,,92,,1,1,1,1,0,0,1,0,0,0,0,0,0,0,0,Après Spectrum,25/03/2016,25/03/2016,30/03/2016,30/03/2016,07/04/2016,07/04/2016,50,,80,,1,0,1,1,0,1,1,0,0,0,0,0,0,0,0,1,,50,,,,50,"0,5",,,186,,,,186,186,1,2,1,1,5,1,1,,,,,1,,,92,,,,,1,1,1,1,2,2,,,,,,,"0,5",,,160,,,,,1,1,1,1,0,3,1,2,6,520,"8,1889762878418",4,5,,,,,,0,0,0,0,0,0,92,1,3,2,4,2,30/03/2016,30/03/2016,07/04/2016,07/04/2016,3,1,3,25/03/2016,13,1976,0,30/03/2016,30/03/2016,3,5,0,5,0,0,0,1,3,2,,,1,1,1,2,1,2,0,0,0,0,7,0,8,0,2,1,1,07/04/2016,13,0,-186,"-18,6000003814697",1,0,0,0,1,2,7,1,2,1
002,Paris - Réanimation Médicale,002-07,002-07,C,M,0,1,1,1,0,0,0,,1,NA/09/1953,,62,62,1,176,69.5,"69,5",84,27.12,"27,12",1,,1,35,13/03/2016,13/03/2016,30/03/2016,30/03/2016,02/04/2016,02/04/2016,1,1,0,0,0,0,0,0,0,0,0,0,0,0,0,0,1,73,95,95,"7,5",37,30,"1,2",1,,0,0,120,56,74,0,0,87,,100,1,0,0,0,0,,,0,3,3,4,0,,18,0,0,5,30,,,0,,0,,,,,,,,,70,,100,,87,,40,,5,,,,21,5,,,5,,,,,,,,,,,,,,,,,,,,,,,,,5,1,570,18,5,30,,,,,,,,,,,,,,,,,,,,,,,,0,,3,0,,,,0,1,,,1,0,0,0,0,0,0,0,0,1,0,0,0,,,,,,,,,,,,,,,,,,,,,,,,,,,,,,,,,,,,,,,,0,0,0,,,,,,,1,1,1,1,0,0,0,0,0,0,0,0,0,0,0,0,0,,1,1,0,0,0,0,0,0,0,0,0,,3,1,3,3,1,1,1,1,2,1,2,2,1,1,Avant Spectrum,13/03/2016,13/03/2016,30/03/2016,30/03/2016,02/04/2016,02/04/2016,4,4,100,,70,,1,1,1,1,0,1,1,0,0,0,0,0,1,1,0,Après Spectrum,13/03/2016,13/03/2016,30/03/2016,30/03/2016,02/04/2016,02/04/2016,40,,87,,0,0,1,1,0,0,1,0,0,0,0,0,0,0,0,1,,30,,,,30,"0,300000011920929",,,"243,33332824707",,,,"243,33332824707","243,33332824707",1,1,,,5,,,,,,,1,,,70,,,,,0,,0,,,,1,1,1,,,,"0,400000005960465",,,"217,5",1,,,,1,1,1,1,0,10,1,2,4,570,"8,20143890380859",4,5,,,,,,1,0,0,0,0,0,70,1,3,2,2,3,30/03/2016,30/03/2016,02/04/2016,02/04/2016,3,1,3,13/03/2016,20,1953,,30/03/2016,30/03/2016,3,17,0,5,,,0,1,3,2,,,0,1,0,,0,,1,0,0,0,1,0,3,0,1,0,1,02/04/2016,20,0,"-243,33332824707","-24,3333320617676",,,,,1,1,1,3,4,3
002,Paris - Réanimation Médicale,002-08,002-08,O,A,0,1,1,1,0,0,0,,1,NA/08/1966,,49,49,1,184,75.5,"75,5",80,23.63,"23,63",13,,1,45,16/03/2016,16/03/2016,30/03/2016,30/03/2016,01/04/2016,01/04/2016,0,0,0,0,0,0,0,0,0,0,0,0,0,0,0,0,0,,,94,,,,,1,,0,0,160,50,104,0,0,90,,,0,0,1,0,0,,,0,4,2,6,0,3,15,0,0,1,,,21,0,,0,0,,,,,,,,350,,100,,,94,,1,1,,,,21,1,,,1,,,,,,,,,,,,,,,,,,,,,,,,,1,,,,,,,,,,,,,,,,,,,,,,,,,,,,,,,,,,,,,,,,,,,,,,,,,,,,0,,,,,,,,,,,,,,,,,,,,,,,,,,,,,,,,,,,,,,,,0,0,0,,,,,,,0,0,0,0,0,0,0,0,0,0,0,0,0,0,0,0,0,,0,0,0,0,0,0,0,0,0,0,0,,1,1,1,1,1,1,1,1,1,1,1,1,2,2,Avant Spectrum,16/03/2016,16/03/2016,30/03/2016,30/03/2016,01/04/2016,01/04/2016,4,2,100,,350,,0,0,0,0,0,0,1,0,0,0,0,0,0,0,0,Après Spectrum,16/03/2016,16/03/2016,30/03/2016,30/03/2016,01/04/2016,01/04/2016,,1,,94,0,0,0,1,0,0,0,0,0,0,0,0,0,0,0,0,,,,21,,21,"0,209999993443489","447,619049072266","456,689331054688","456,689331054688",,,,"456,689331054688","456,689331054688",0,,,,,,,,,,,1,,,350,,,,,0,,0,,,,,,,,0,24,"0,239999994635582","391,666687011719","390,079376220703","390,079376220703",,,,,0,,0,,0,12,,1,2,,,,,,,,,,0,0,0,0,0,0,350,0,,2,4,2,30/03/2016,30/03/2016,01/04/2016,01/04/2016,3,0,3,16/03/2016,16,1966,,30/03/2016,30/03/2016,3,14,1,1,,,0,4,,,,,,0,0,,0,,0,0,0,0,13,0,2,0,0,,0,01/04/2016,16,1,"-456,689331054688","-45,6689338684082",,,,,0,,13,0,1,1
002,Paris - Réanimation Médicale,002-09,002-09,M,M,0,1,1,1,0,0,0,,1,NA/08/1989,,26,26,2,170,62,62,44,15.22,"15,22",16,BICYTOPENIE FEBRILE,1,6,28/03/2016,28/03/2016,30/03/2016,30/03/2016,31/03/2016,31/03/2016,1,0,0,0,0,0,0,0,0,0,0,0,0,0,0,0,0,,,99,,,,,1,,0,0,110,67,81,0,0,90,,100,0,0,0,0,0,,,0,4,5,6,,1,14,0,0,1,,,21,0,,0,0,,,,,,,,89,,21,,,100,21,,1,,,,21,1,,,1,,,,,,,,,,,,,,,,,,,,,,,,,1,,,,,,,,,,,,,,,,,,,,,,,,,,,,,,,,,,,,,,,,,,,,,,,,,,,,0,,,,,,,,,,,,,,,,,,,,,,,,,,,,,,,,,,,,,,,,0,0,0,,,,,,,0,0,0,0,0,0,0,0,0,0,0,0,0,0,0,0,0,,0,0,0,0,0,0,0,0,0,0,0,,1,1,1,3,1,1,1,1,1,1,2,2,1,1,Avant Spectrum,28/03/2016,28/03/2016,30/03/2016,30/03/2016,31/03/2016,31/03/2016,4,1,21,,89,,0,0,0,0,0,0,0,0,0,0,0,0,0,0,0,Après Spectrum,28/03/2016,28/03/2016,30/03/2016,30/03/2016,31/03/2016,31/03/2016,21,,,100,0,0,0,0,0,0,0,0,0,0,0,0,0,0,0,1,,,,21,,21,"0,209999993443489","471,428588867188","485,034027099609","485,034027099609",,,,"485,034027099609","485,034027099609",0,,,,,,,,,,,"0,209999993443489",,,"423,809539794922",,,,,0,,0,,,,,,,,0,,"0,209999993443489","476,190490722656","490,702972412109","490,702972412109",,,,,0,,0,,0,15,,1,1,,,,,,,,,,0,0,0,0,0,0,"423,809539794922",0,,6,9,6,30/03/2016,30/03/2016,31/03/2016,31/03/2016,3,1,3,28/03/2016,3,1989,,30/03/2016,30/03/2016,3,2,0,1,,,0,4,,,,,,0,0,,0,,0,0,0,0,16,0,1,0,0,,1,31/03/2016,3,0,"-485,034027099609","-48,5034027099609",,,,,0,,16,0,1,1
002,Paris - Réanimation Médicale,002-10,002-10,B,M,0,1,1,1,0,0,0,,1,NA/12/1940,,75,75,1,162,59,59,98,37.34,"37,34",8,,1,32,24/03/2016,24/03/2016,30/03/2016,30/03/2016,04/04/2016,04/04/2016,1,1,0,0,0,0,0,1,0,0,0,1,0,0,0,0,1,79,96,95,"7,34",55,31,"1,1",1,,0,0,124,76,88,0,0,87,,94,0,0,0,0,0,,,0,4,5,6,,1,25,1,0,4,25,,,0,,0,,,,,,,2,25,134,,40,,84,,60,,4,,,,21,4,,,4,2,,,,,560,12,5,25,,,,,,,,,,,,,,2,3,4,,,,,,,,,,,,,,,,,,,,,,,,,,,,,,,,,,,,,,,,,,,,,,,,,,,,1,0,,,,,,,94,25,3,180,1,,2,,,,,,550,12,5,25,,,,,,,,,,,,,2,1,0,3,0,0,0,,,,,,,0,0,0,0,0,0,0,0,0,0,0,0,0,0,0,0,0,,0,1,0,0,0,0,0,0,0,0,0,,3,1,3,2,2,1,1,1,1,1,2,2,1,1,Avant Spectrum,24/03/2016,24/03/2016,30/03/2016,30/03/2016,04/04/2016,04/04/2016,4,3,40,,134,,0,0,0,1,0,1,0,0,0,0,0,0,0,0,0,Après Spectrum,24/03/2016,24/03/2016,30/03/2016,30/03/2016,04/04/2016,04/04/2016,60,,84,,1,0,1,1,0,1,1,0,0,0,0,0,0,0,0,1,25,,,,,25,"0,25",,,316,"0,25",376,"371,428558349609",316,316,0,,,,5,,,,,,,"0,400000005960465",,,335,,,,,0,,0,,,,,,,,,,"0,600000023841858",,,140,1,,,,0,,0,,1,15,,2,3,,,,,,560,"9,49152565002441",4,5,0,0,0,0,0,0,140,1,2,2,2,3,30/03/2016,30/03/2016,04/04/2016,04/04/2016,3,1,3,24/03/2016,11,1940,,30/03/2016,30/03/2016,3,6,0,4,,,0,1,,,3,2,1,0,0,,0,,1,0,1,0,8,0,5,0,0,0,1,04/04/2016,11,0,-316,"-31,6000003814697",,,,,1,2,8,1,2,1
002,Paris - Réanimation Médicale,002-11,002-11,M,V,0,1,1,1,0,0,0,,1,NA/05/1962,,53,53,1,170,65,65,82,28.37,"28,37",9,,1,38,29/03/2016,29/03/2016,30/03/2016,30/03/2016,02/04/2016,02/04/2016,1,0,0,0,0,0,0,0,0,0,0,0,0,0,0,0,1,141,99,100,"7,35",43,25,3,1,,0,0,152,92,105,0,0,90,,100,1,0,1,0,0,,,0,1,1,1,-3,,18,0,0,5,75,,,0,,0,,,,,,,,,92,,75,,84,,40,,5,,,,21,5,,,5,,,,,,,,,,,,,,,,,,,,,,,,,5,1,580,16,5,75,,,,,,,,,,,,,,,,,,,,,,,,0,,3,0,,,,0,1,,,1,0,0,0,0,0,0,0,0,0,0,0,0,,,,,,,,,,,,,,,,,,,,,,,,,,,,,,,,,,,,,,,,0,0,1,1,0,1,0,0,0,0,0,0,1,0,1,0,0,0,0,0,0,0,0,0,0,0,,0,0,0,0,0,0,0,0,0,0,0,,3,1,3,2,1,1,1,1,1,1,2,1,1,1,Avant Spectrum,29/03/2016,29/03/2016,30/03/2016,30/03/2016,02/04/2016,02/04/2016,4,3,75,,92,,0,1,1,0,0,0,1,0,0,0,0,0,0,0,0,Après Spectrum,29/03/2016,29/03/2016,30/03/2016,30/03/2016,02/04/2016,02/04/2016,40,,84,,1,0,1,1,0,0,1,0,0,0,0,0,0,0,0,1,,75,,,,75,"0,75",,,188,,,,188,188,1,2,,,5,,,,,,,"0,75",,,"122,666664123535",,,,,0,,0,,,,1,,,,,,"0,400000005960465",,,210,1,,,,0,,0,,0,3,1,2,3,580,"8,92307662963867",4,5,,,,,,0,0,0,0,0,0,"122,666664123535",1,2,2,4,2,30/03/2016,30/03/2016,02/04/2016,02/04/2016,3,1,3,29/03/2016,4,1962,,30/03/2016,30/03/2016,3,1,0,5,,,0,1,3,2,,,0,1,0,,0,,0,0,0,0,9,0,3,0,2,1,1,02/04/2016,4,0,-188,"-18,7999992370605",,,,,1,1,9,2,3,2